Skip to main content

wince arm evc CLDC build error

1 reply [Last post]
geelpheels
Offline
Joined: 2006-05-05
Points: 0

When I build CLDC, following error reported:
......
JVM_win32.cpp
F:\phoneme_feature_mr3\phoneme_feature_wince\cldc\src\vm\os\win32\JVM_win32.cpp(
127) : error C2039: 'SegCs' : is not a member of '_CONTEXT'
F:/WINDOW~2/wce400/STANDARDSDK/Include/Armv4\winnt.h(2836) : see declara
tion of '_CONTEXT'
F:\phoneme_feature_mr3\phoneme_feature_wince\cldc\src\vm\os\win32\JVM_win32.cpp(
128) : error C2039: 'SegEs' : is not a member of '_CONTEXT'
F:/WINDOW~2/wce400/STANDARDSDK/Include/Armv4\winnt.h(2836) : see declara
tion of '_CONTEXT'
F:\phoneme_feature_mr3\phoneme_feature_wince\cldc\src\vm\os\win32\JVM_win32.cpp(
129) : error C2039: 'SegDs' : is not a member of '_CONTEXT'
F:/WINDOW~2/wce400/STANDARDSDK/Include/Armv4\winnt.h(2836) : see declara
tion of '_CONTEXT'
F:\phoneme_feature_mr3\phoneme_feature_wince\cldc\src\vm\os\win32\JVM_win32.cpp(
130) : error C2039: 'SegGs' : is not a member of '_CONTEXT'
F:/WINDOW~2/wce400/STANDARDSDK/Include/Armv4\winnt.h(2836) : see declara
tion of '_CONTEXT'
F:\phoneme_feature_mr3\phoneme_feature_wince\cldc\src\vm\os\win32\JVM_win32.cpp(
131) : error C2039: 'SegFs' : is not a member of '_CONTEXT'
F:/WINDOW~2/wce400/STANDARDSDK/Include/Armv4\winnt.h(2836) : see declara
tion of '_CONTEXT'
F:\phoneme_feature_mr3\phoneme_feature_wince\cldc\src\vm\os\win32\JVM_win32.cpp(
132) : error C2039: 'SegSs' : is not a member of '_CONTEXT'
F:/WINDOW~2/wce400/STANDARDSDK/Include/Armv4\winnt.h(2836) : see declara
tion of '_CONTEXT'
F:\phoneme_feature_mr3\phoneme_feature_wince\cldc\src\vm\os\win32\JVM_win32.cpp(
133) : error C2039: 'Eax' : is not a member of '_CONTEXT'
F:/WINDOW~2/wce400/STANDARDSDK/Include/Armv4\winnt.h(2836) : see declara
tion of '_CONTEXT'
F:\phoneme_feature_mr3\phoneme_feature_wince\cldc\src\vm\os\win32\JVM_win32.cpp(
134) : error C2039: 'Ebx' : is not a member of '_CONTEXT'
F:/WINDOW~2/wce400/STANDARDSDK/Include/Armv4\winnt.h(2836) : see declara
tion of '_CONTEXT'
F:\phoneme_feature_mr3\phoneme_feature_wince\cldc\src\vm\os\win32\JVM_win32.cpp(
135) : error C2039: 'Ecx' : is not a member of '_CONTEXT'
F:/WINDOW~2/wce400/STANDARDSDK/Include/Armv4\winnt.h(2836) : see declara
tion of '_CONTEXT'
F:\phoneme_feature_mr3\phoneme_feature_wince\cldc\src\vm\os\win32\JVM_win32.cpp(
136) : error C2039: 'Edx' : is not a member of '_CONTEXT'
F:/WINDOW~2/wce400/STANDARDSDK/Include/Armv4\winnt.h(2836) : see declara
tion of '_CONTEXT'
F:\phoneme_feature_mr3\phoneme_feature_wince\cldc\src\vm\os\win32\JVM_win32.cpp(
137) : error C2039: 'Edi' : is not a member of '_CONTEXT'
F:/WINDOW~2/wce400/STANDARDSDK/Include/Armv4\winnt.h(2836) : see declara
tion of '_CONTEXT'
F:\phoneme_feature_mr3\phoneme_feature_wince\cldc\src\vm\os\win32\JVM_win32.cpp(
138) : error C2039: 'Esi' : is not a member of '_CONTEXT'
F:/WINDOW~2/wce400/STANDARDSDK/Include/Armv4\winnt.h(2836) : see declara
tion of '_CONTEXT'
F:\phoneme_feature_mr3\phoneme_feature_wince\cldc\src\vm\os\win32\JVM_win32.cpp(
139) : error C2039: 'Ebp' : is not a member of '_CONTEXT'
F:/WINDOW~2/wce400/STANDARDSDK/Include/Armv4\winnt.h(2836) : see declara
tion of '_CONTEXT'
F:\phoneme_feature_mr3\phoneme_feature_wince\cldc\src\vm\os\win32\JVM_win32.cpp(
140) : error C2039: 'Esp' : is not a member of '_CONTEXT'
F:/WINDOW~2/wce400/STANDARDSDK/Include/Armv4\winnt.h(2836) : see declara
tion of '_CONTEXT'
F:\phoneme_feature_mr3\phoneme_feature_wince\cldc\src\vm\os\win32\JVM_win32.cpp(
141) : error C2039: 'Eip' : is not a member of '_CONTEXT'
F:/WINDOW~2/wce400/STANDARDSDK/Include/Armv4\winnt.h(2836) : see declara
tion of '_CONTEXT'
F:\phoneme_feature_mr3\phoneme_feature_wince\cldc\src\vm\os\win32\JVM_win32.cpp(
142) : error C2039: 'EFlags' : is not a member of '_CONTEXT'
F:/WINDOW~2/wce400/STANDARDSDK/Include/Armv4\winnt.h(2836) : see declara
tion of '_CONTEXT'
make[1]: *** [JVM_win32.obj] Error 2
make[1]: Leaving directory `F:/phoneme_feature_mr3/phoneme_feature_wince/build_o
utput/cldc/wince_arm/loopgen/app'
make: *** [_loopgen] Error 2
make: Leaving directory `F:/phoneme_feature_mr3/phoneme_feature_wince/cldc/build
/wince_arm'

But I do included needed files in JVM_win32.cpp.
They were listed below:

#define _X86
#include
#include
......

But the error still occurs.

OK. Because the library is not right.

Reply viewing options

Select your preferred way to display the comments and click "Save settings" to activate your changes.
geelpheels
Offline
Joined: 2006-05-05
Points: 0

It is my own fault. Using the incorrect library and includes.