Skip to main content

stdio.h file is not found by compiler

1 reply [Last post]
gammy
Offline
Joined: 2008-01-08

hello,

i am getting following problem whilw cross compiling pcsl.

building all modules...
cd /home/user/phoneme_feature/pcsl/types; make all
make[1]: Entering directory `/home/user/phoneme_feature/pcsl/types'
make[1]: Leaving directory `/home/user/phoneme_feature/pcsl/types'
cd /home/user/phoneme_feature/pcsl/print; make all
make[1]: Entering directory `/home/user/phoneme_feature/pcsl/print'
building print module...
make[2]: Entering directory `/home/user/phoneme_feature/pcsl/print/
stdout'
pcsl_print.c:33:19: error: stdio.h: No such file or directory
pcsl_print.c: In function 'pcsl_print':
pcsl_print.c:44: warning: incompatible implicit declaration of built-
in function 'printf'
make[2]: *** [/home/user/phoneme_feature/build_output/linux_arm/obj/
pcsl_print.o] Error 1
make[2]: Leaving directory `/home/user/phoneme_feature/pcsl/print/
stdout'
make[1]: *** [all] Error 2
make[1]: Leaving directory `/home/user/phoneme_feature/pcsl/print'
make: *** [all] Error 2

can any body help me in solving this problem.

Reply viewing options

Select your preferred way to display the comments and click "Save settings" to activate your changes.
geelpheels
Offline
Joined: 2006-05-05

Maybe your include path is set incorrectly. The compiler cannot find the file in your include path.