Skip to main content

building PCSL: how to specify include headers

7 replies [Last post]
omone
Offline
Joined: 2007-07-25

Hi all,
I follow all the steps of the MR2 guide (https://phoneme.dev.java.net/content/mr2/index_feature.html) and set all the necessary environment variables to build PhoneME with target ARM on a Fedora Core 6 build system.
It seems that the pcsl make isn't able to find simple headers as "stdio.h".

Why does it happen?
Where is possible to specify all the includes that are necessary?
How is it possible to see how gcc is launched? Is there a flag somewhere in all the makefile dependencies?

This is the output:
----------------------------------------------------
make NETWORK_MODULE=bsd/qte PCSL_PLATFORM=linux_arm_gcc PCSL_OUTPUT_DIR=/home/user/phoneme_feature/build_output GNU_TOOLS_DIR=/usr/arm-crosstool-linux-gnueabi
generating config file...
building all modules...
cd /home/user/phoneme_feature/pcsl/types; make all
make[1]: Entering directory `/home/user/phoneme_feature/pcsl/types'
make[1]: Leaving directory `/home/user/phoneme_feature/pcsl/types'
cd /home/user/phoneme_feature/pcsl/print; make all
make[1]: Entering directory `/home/user/phoneme_feature/pcsl/print'
building print module...
make[2]: Entering directory `/home/user/phoneme_feature/pcsl/print/stdout'
pcsl_print.c:33:19: error: stdio.h: No such file or directory
pcsl_print.c: In function 'pcsl_print':
pcsl_print.c:44: warning: incompatible implicit declaration of built-in function 'printf'
make[2]: *** [/home/user/phoneme_feature/build_output/linux_arm/obj/pcsl_print.o] Error 1
make[2]: Leaving directory `/home/user/phoneme_feature/pcsl/print/stdout'
make[1]: *** [all] Error 2
make[1]: Leaving directory `/home/user/phoneme_feature/pcsl/print'
make: *** [all] Error 2
------------------------------------------------------

Thank you in advance

Reply viewing options

Select your preferred way to display the comments and click "Save settings" to activate your changes.
gammy
Offline
Joined: 2008-01-08

hello omone i am also facing the same problem fif u have resolved this problem please help me.

thank you.

asif_kalim
Offline
Joined: 2007-11-30

hi gammy,
did u check build all pcsl modules at once? if not then run a clean (make clean) and then build all.

thanks,
asif

gammy
Offline
Joined: 2008-01-08

Hi asif

i am getting the following problem while building CLDC can u help me with this java error. i searched on net but i am not getting any clue. thanks in advance.

========================================================
mkdir: cannot create directory `/home/phoneme_feature/build_output': File exists
make[1]: Entering directory `/home/phoneme_feature/cldc/build/linux_arm_926'
... copied root Makefiles
make[1]: Leaving directory `/home/phoneme_feature/cldc/build/linux_arm_926'
==================================
JVMBuildSpace = /home/phoneme_feature/build_output/cldc
JVMWorkSpace = /home/phoneme_feature/cldc
ROMIZING = true
SHELL = /bin/sh
ENABLE_ISOLATES =
ENABLE_MONET =
==================================
created /home/phoneme_feature/build_output/cldc/linux_arm_926/tools/Makefile
==============================
creating build tools...
==============================
make[1]: Entering directory `/home/phoneme_feature/build_output/cldc/linux_arm_926/tools'
Note: Some input files use or override a deprecated API.
Note: Recompile with -deprecation for details.
created jcc.jar
created buildtool.jar
make[1]: Leaving directory `/home/phoneme_feature/build_output/cldc/linux_arm_926/tools'
done
Finding .java files ...
done
created /home/phoneme_feature/build_output/cldc/linux_arm_926/loopgen/app/Makefile
==============================
creating ASM loop generator in debug mode
build flags: NO_DEBUG_SYMBOLS=true
==============================
make[1]: Entering directory `/home/phoneme_feature/build_output/cldc/linux_arm_926/loopgen/app'
Exception in thread "main" java.lang.NoClassDefFoundError: JavaCodeCompact
make[1]: *** [../generated/jvmconfig.h] Error 1
make[1]: Leaving directory `/home/phoneme_feature/build_output/cldc/linux_arm_926/loopgen/app'
make: *** [_loopgen] Error 2
[root@localhost phoneme_feature]#

asif_kalim
Offline
Joined: 2007-11-30

hi gammy,
i need some details about your build.
1- are you using latest source code, if not then get it from https://phoneme.dev.java.net/svn/phoneme/components/cldc/trunk
2- can u send me the make command that u r using to build cldc and its output with VERBOSE_BUILD=true.
3- which jdk version are u using, it must be 1.4.x.

--
asif

gammy
Offline
Joined: 2008-01-08

Hi asif,

i am buildind CLDC on ARM9 and while cross compiling the folloing errors are coming. can u help me ?

==============================

creating build tools...

==============================

make[1]: Entering directory `/home/phoneme_feature/build_output/cldc/
linux_arm_926/tools'

Note: Some input files use or override a deprecated API.

Note: Recompile with -deprecation for details.

created jcc.jar

created buildtool.jar

make[1]: Leaving directory `/home/phoneme_feature/build_output/cldc/
linux_arm_926/tools'

done

Finding .java files ...

done

created /home/phoneme_feature/build_output/cldc/linux_arm_926/loopgen/
app/Makefile

==============================

creating ASM loop generator in debug mode

build flags: NO_DEBUG_SYMBOLS=true

==============================

make[1]: Entering directory `/home/phoneme_feature/build_output/cldc/
linux_arm_926/loopgen/app'

generating ../generated/Dependencies ...

reading database: /home/phoneme_feature/cldc/src/vm/includeDB

merging source files, limit = 35

excluded from merging: JarFileUncommon.cpp

excluded from merging: OsFile.cpp

excluded from merging: OsFile_linux.cpp

excluded from merging: OsMemory.cpp

excluded from merging: OsMemory_linux.cpp

excluded from merging: OsMisc_linux.cpp

excluded from merging: OsSocket_linux.cpp

excluded from merging: OS_linux.cpp

excluded from merging: KniUncommon.cpp

excluded from merging: NativesTable.cpp

excluded from merging: FloatSupport_arm.cpp

excluded from merging: ROMImage.cpp

excluded from merging: jvmspi.cpp

excluded from merging: Main_linux.cpp

excluded from merging: BSDSocket.cpp

excluded from merging: PCSLSocket.cpp

excluded from merging: HotRoutines0.cpp

excluded from merging: HotRoutines1.cpp

excluded from merging: ReflectNatives.cpp

writing individual include files ...couldn't find in vpath:
ROMImage.hpp

couldn't find in vpath: OS.hpp

couldn't find in vpath: ROM.hpp

couldn't find in vpath: JVM.hpp

couldn't find in vpath: ROMImage.hpp

couldn't find in vpath: OS.hpp

couldn't find in vpath: ROMImage.hpp

couldn't find in vpath: OS.hpp

couldn't find in vpath: ROM.hpp

couldn't find in vpath: JVM.hpp

couldn't find in vpath: OS.cpp

couldn't find in vpath: ROMImage.hpp

couldn't find in vpath: ROMImage.hpp

couldn't find in vpath: OS.hpp

couldn't find in vpath: ROMImage.hpp

couldn't find in vpath: OS.hpp

couldn't find in vpath: ROMImage.hpp

couldn't find in vpath: OS.hpp

couldn't find in vpath: ROMImage.hpp

couldn't find in vpath: OS.hpp

couldn't find in vpath: ROMImage.hpp

couldn't find in vpath: OS.hpp

couldn't find in vpath: ROMImage.hpp

couldn't find in vpath: OS.hpp

couldn't find in vpath: ROM.hpp

couldn't find in vpath: ROMImage.hpp

couldn't find in vpath: OS.hpp

couldn't find in vpath: ROM.hpp

couldn't find in vpath: ROMTools.hpp

couldn't find in vpath: ROMProfile.hpp

couldn't find in vpath: ROMOptimizer.hpp

couldn't find in vpath: ROMWriter.hpp

couldn't find in vpath: JVM.hpp

couldn't find in vpath: SourceROMWriter.hpp

couldn't find in vpath: BinaryROMWriter.hpp

couldn't find in vpath: SegmentedSourceROMWriter.hpp

couldn't find in vpath: ROMImage.hpp

couldn't find in vpath: OS.hpp

couldn't find in vpath: ROM.hpp

couldn't find in vpath: ROMImage.hpp

couldn't find in vpath: OS.hpp

couldn't find in vpath: ROM.hpp

couldn't find in vpath: ROMImage.hpp

couldn't find in vpath: OS.hpp

couldn't find in vpath: ROM.hpp

couldn't find in vpath: ROMTools.hpp

couldn't find in vpath: ROMProfile.hpp

couldn't find in vpath: ROMOptimizer.hpp

couldn't find in vpath: ROMWriter.hpp

couldn't find in vpath: JVM.hpp

couldn't find in vpath: SourceROMWriter.hpp

couldn't find in vpath: BinaryROMWriter.hpp

couldn't find in vpath: BytecodeOptimizer.hpp

couldn't find in vpath: ConstantPoolRewriter.hpp

couldn't find in vpath: ROMStructsWriter.hpp

couldn't find in vpath: ROMWriter.cpp

couldn't find in vpath: SourceObjectWriter.cpp

couldn't find in vpath: SourceROMWriter.cpp

couldn't find in vpath: ROMStructsWriter.cpp

couldn't find in vpath: ROMImage.hpp

couldn't find in vpath: OS.hpp

couldn't find in vpath: ROM.hpp

couldn't find in vpath: ROMTools.hpp

couldn't find in vpath: ROMTools.cpp

couldn't find in vpath: ROMProfile.hpp

couldn't find in vpath: ROMOptimizer.hpp

couldn't find in vpath: JVM.hpp

couldn't find in vpath: BytecodeOptimizer.hpp

couldn't find in vpath: ConstantPoolRewriter.hpp

couldn't find in vpath: MethodInvocationClosure.hpp

couldn't find in vpath: ROMInliner.hpp

couldn't find in vpath: ROMWriter.hpp

couldn't find in vpath: ROMOptimizer.cpp

couldn't find in vpath: SourceROMOptimizer.cpp

couldn't find in vpath: SourceROMWriter.hpp

couldn't find in vpath: SegmentedSourceROMWriter.hpp

couldn't find in vpath: ROM.cpp

couldn't find in vpath: BinaryROM.cpp

couldn't find in vpath: BinaryROMWriter.hpp

couldn't find in vpath: JVM.cpp

couldn't find in vpath: BytecodeOptimizer.cpp

couldn't find in vpath: ConstantPoolRewriter.cpp

couldn't find in vpath: ROMImage.hpp

couldn't find in vpath: ROMImage.hpp

couldn't find in vpath: OS.hpp

couldn't find in vpath: ROMImage.hpp

couldn't find in vpath: OS.hpp

couldn't find in vpath: ROMImage.hpp

couldn't find in vpath: OS.hpp

couldn't find in vpath: ROMImage.hpp

couldn't find in vpath: OS.hpp

couldn't find in vpath: ROMImage.hpp

couldn't find in vpath: OS.hpp

couldn't find in vpath: ROM.hpp

couldn't find in vpath: MethodInvocationClosure.hpp

couldn't find in vpath: ROMTools.hpp

couldn't find in vpath: ROMProfile.hpp

couldn't find in vpath: ROMOptimizer.hpp

couldn't find in vpath: MethodInvocationClosure.cpp

couldn't find in vpath: ROMInliner.hpp

couldn't find in vpath: ROMInliner.cpp

couldn't find in vpath: JVM.hpp

couldn't find in vpath: ROMWriter.hpp

couldn't find in vpath: ROMProfile.cpp

couldn't find in vpath: SourceROMWriter.hpp

couldn't find in vpath: SegmentedSourceROMWriter.hpp

couldn't find in vpath: SegmentedSourceROMWriter.cpp

couldn't find in vpath: ROMImage.hpp

couldn't find in vpath: OS.hpp

couldn't find in vpath: ROM.hpp

couldn't find in vpath: ROMImage.hpp

couldn't find in vpath: OS.hpp

couldn't find in vpath: ROM.hpp

couldn't find in vpath: ROMImage.hpp

couldn't find in vpath: OS.hpp

couldn't find in vpath: ROM.hpp

done (25 files.)

writing grand include file

couldn't find in vpath: ROMImage.hpp

couldn't find in vpath: OS.hpp

couldn't find in vpath: ROM.hpp

couldn't find in vpath: JVM.hpp

couldn't find in vpath: ROMImage.hpp

couldn't find in vpath: OS.hpp

couldn't find in vpath: ROMImage.hpp

couldn't find in vpath: OS.hpp

couldn't find in vpath: ROM.hpp

couldn't find in vpath: JVM.hpp

couldn't find in vpath: ROMImage.hpp

couldn't find in vpath: ROMImage.hpp

couldn't find in vpath: OS.hpp

couldn't find in vpath: ROMImage.hpp

couldn't find in vpath: OS.hpp

couldn't find in vpath: ROMImage.hpp

couldn't find in vpath: OS.hpp

couldn't find in vpath: ROMImage.hpp

couldn't find in vpath: OS.hpp

couldn't find in vpath: ROMImage.hpp

couldn't find in vpath: OS.hpp

couldn't find in vpath: ROMImage.hpp

couldn't find in vpath: OS.hpp

couldn't find in vpath: ROM.hpp

couldn't find in vpath: ROMImage.hpp

couldn't find in vpath: OS.hpp

couldn't find in vpath: ROM.hpp

couldn't find in vpath: ROMTools.hpp

couldn't find in vpath: ROMProfile.hpp

couldn't find in vpath: ROMOptimizer.hpp

couldn't find in vpath: ROMWriter.hpp

couldn't find in vpath: JVM.hpp

couldn't find in vpath: SourceROMWriter.hpp

couldn't find in vpath: BinaryROMWriter.hpp

couldn't find in vpath: SegmentedSourceROMWriter.hpp

couldn't find in vpath: ROMImage.hpp

couldn't find in vpath: OS.hpp

couldn't find in vpath: ROM.hpp

couldn't find in vpath: ROMImage.hpp

couldn't find in vpath: OS.hpp

couldn't find in vpath: ROM.hpp

couldn't find in vpath: ROMImage.hpp

couldn't find in vpath: OS.hpp

couldn't find in vpath: ROM.hpp

couldn't find in vpath: ROMTools.hpp

couldn't find in vpath: ROMProfile.hpp

couldn't find in vpath: ROMOptimizer.hpp

couldn't find in vpath: ROMWriter.hpp

couldn't find in vpath: JVM.hpp

couldn't find in vpath: SourceROMWriter.hpp

couldn't find in vpath: BinaryROMWriter.hpp

couldn't find in vpath: BytecodeOptimizer.hpp

couldn't find in vpath: ConstantPoolRewriter.hpp

couldn't find in vpath: ROMStructsWriter.hpp

couldn't find in vpath: ROMImage.hpp

couldn't find in vpath: OS.hpp

couldn't find in vpath: ROM.hpp

couldn't find in vpath: ROMTools.hpp

couldn't find in vpath: ROMProfile.hpp

couldn't find in vpath: ROMOptimizer.hpp

couldn't find in vpath: JVM.hpp

couldn't find in vpath: BytecodeOptimizer.hpp

couldn't find in vpath: ConstantPoolRewriter.hpp

couldn't find in vpath: MethodInvocationClosure.hpp

couldn't find in vpath: ROMInliner.hpp

couldn't find in vpath: ROMWriter.hpp

couldn't find in vpath: SourceROMWriter.hpp

couldn't find in vpath: SegmentedSourceROMWriter.hpp

couldn't find in vpath: BinaryROMWriter.hpp

couldn't find in vpath: ROMImage.hpp

couldn't find in vpath: ROMImage.hpp

couldn't find in vpath: OS.hpp

couldn't find in vpath: ROMImage.hpp

couldn't find in vpath: OS.hpp

couldn't find in vpath: ROMImage.hpp

couldn't find in vpath: OS.hpp

couldn't find in vpath: ROMImage.hpp

couldn't find in vpath: OS.hpp

couldn't find in vpath: ROMImage.hpp

couldn't find in vpath: OS.hpp

couldn't find in vpath: ROM.hpp

couldn't find in vpath: MethodInvocationClosure.hpp

couldn't find in vpath: ROMTools.hpp

couldn't find in vpath: ROMProfile.hpp

couldn't find in vpath: ROMOptimizer.hpp

couldn't find in vpath: ROMInliner.hpp

couldn't find in vpath: JVM.hpp

couldn't find in vpath: ROMWriter.hpp

couldn't find in vpath: SourceROMWriter.hpp

couldn't find in vpath: SegmentedSourceROMWriter.hpp

couldn't find in vpath: ROMImage.hpp

couldn't find in vpath: OS.hpp

couldn't find in vpath: ROM.hpp

couldn't find in vpath: ROMImage.hpp

couldn't find in vpath: OS.hpp

couldn't find in vpath: ROM.hpp

couldn't find in vpath: ROMImage.hpp

couldn't find in vpath: OS.hpp

couldn't find in vpath: ROM.hpp

writing dependencies file

couldn't find in vpath: ROMImage.hpp

couldn't find in vpath: OS.hpp

couldn't find in vpath: ROM.hpp

couldn't find in vpath: JVM.hpp

couldn't find in vpath: ROMImage.hpp

couldn't find in vpath: OS.hpp

couldn't find in vpath: ROMImage.hpp

couldn't find in vpath: OS.hpp

couldn't find in vpath: ROM.hpp

couldn't find in vpath: JVM.hpp

couldn't find in vpath: OS.cpp

couldn't find in vpath: ROMImage.hpp

couldn't find in vpath: ROMImage.hpp

couldn't find in vpath: OS.hpp

couldn't find in vpath: ROMImage.hpp

couldn't find in vpath: OS.hpp

couldn't find in vpath: ROMImage.hpp

couldn't find in vpath: OS.hpp

couldn't find in vpath: ROMImage.hpp

couldn't find in vpath: OS.hpp

couldn't find in vpath: ROMImage.hpp

couldn't find in vpath: OS.hpp

couldn't find in vpath: ROMImage.hpp

couldn't find in vpath: OS.hpp

couldn't find in vpath: ROM.hpp

couldn't find in vpath: ROMImage.hpp

couldn't find in vpath: OS.hpp

couldn't find in vpath: ROM.hpp

couldn't find in vpath: ROMTools.hpp

couldn't find in vpath: ROMProfile.hpp

couldn't find in vpath: ROMOptimizer.hpp

couldn't find in vpath: ROMWriter.hpp

couldn't find in vpath: JVM.hpp

couldn't find in vpath: SourceROMWriter.hpp

couldn't find in vpath: BinaryROMWriter.hpp

couldn't find in vpath: SegmentedSourceROMWriter.hpp

couldn't find in vpath: ROMImage.hpp

couldn't find in vpath: OS.hpp

couldn't find in vpath: ROM.hpp

couldn't find in vpath: ROMImage.hpp

couldn't find in vpath: OS.hpp

couldn't find in vpath: ROM.hpp

couldn't find in vpath: ROMImage.hpp

couldn't find in vpath: OS.hpp

couldn't find in vpath: ROM.hpp

couldn't find in vpath: ROMTools.hpp

couldn't find in vpath: ROMProfile.hpp

couldn't find in vpath: ROMOptimizer.hpp

couldn't find in vpath: ROMWriter.hpp

couldn't find in vpath: JVM.hpp

couldn't find in vpath: SourceROMWriter.hpp

couldn't find in vpath: BinaryROMWriter.hpp

couldn't find in vpath: BytecodeOptimizer.hpp

couldn't find in vpath: ConstantPoolRewriter.hpp

couldn't find in vpath: ROMStructsWriter.hpp

couldn't find in vpath: ROMWriter.cpp

couldn't find in vpath: SourceObjectWriter.cpp

couldn't find in vpath: SourceROMWriter.cpp

couldn't find in vpath: ROMStructsWriter.cpp

couldn't find in vpath: ROMImage.hpp

couldn't find in vpath: OS.hpp

couldn't find in vpath: ROM.hpp

couldn't find in vpath: ROMTools.hpp

couldn't find in vpath: ROMTools.cpp

couldn't find in vpath: ROMProfile.hpp

couldn't find in vpath: ROMOptimizer.hpp

couldn't find in vpath: JVM.hpp

couldn't find in vpath: BytecodeOptimizer.hpp

couldn't find in vpath: ConstantPoolRewriter.hpp

couldn't find in vpath: MethodInvocationClosure.hpp

couldn't find in vpath: ROMInliner.hpp

couldn't find in vpath: ROMWriter.hpp

couldn't find in vpath: ROMOptimizer.cpp

couldn't find in vpath: SourceROMOptimizer.cpp

couldn't find in vpath: SourceROMWriter.hpp

couldn't find in vpath: SegmentedSourceROMWriter.hpp

couldn't find in vpath: ROM.cpp

couldn't find in vpath: BinaryROM.cpp

couldn't find in vpath: BinaryROMWriter.hpp

couldn't find in vpath: JVM.cpp

couldn't find in vpath: BytecodeOptimizer.cpp

couldn't find in vpath: ConstantPoolRewriter.cpp

couldn't find in vpath: ROMImage.hpp

couldn't find in vpath: ROMImage.hpp

couldn't find in vpath: OS.hpp

couldn't find in vpath: ROMImage.hpp

couldn't find in vpath: OS.hpp

couldn't find in vpath: ROMImage.hpp

couldn't find in vpath: OS.hpp

couldn't find in vpath: ROMImage.hpp

couldn't find in vpath: OS.hpp

couldn't find in vpath: ROMImage.hpp

couldn't find in vpath: OS.hpp

couldn't find in vpath: ROM.hpp

couldn't find in vpath: MethodInvocationClosure.hpp

couldn't find in vpath: ROMTools.hpp

couldn't find in vpath: ROMProfile.hpp

couldn't find in vpath: ROMOptimizer.hpp

couldn't find in vpath: MethodInvocationClosure.cpp

couldn't find in vpath: ROMInliner.hpp

couldn't find in vpath: ROMInliner.cpp

couldn't find in vpath: JVM.hpp

couldn't find in vpath: ROMWriter.hpp

couldn't find in vpath: ROMProfile.cpp

couldn't find in vpath: SourceROMWriter.hpp

couldn't find in vpath: SegmentedSourceROMWriter.hpp

couldn't find in vpath: SegmentedSourceROMWriter.cpp

couldn't find in vpath: ROMImage.hpp

couldn't find in vpath: OS.hpp

couldn't find in vpath: ROM.hpp

couldn't find in vpath: ROMImage.hpp

couldn't find in vpath: OS.hpp

couldn't find in vpath: ROM.hpp

couldn't find in vpath: ROMImage.hpp

couldn't find in vpath: OS.hpp

couldn't find in vpath: ROM.hpp

couldn't find in vpath: ROMImage.hpp

couldn't find in vpath: OS.hpp

couldn't find in vpath: ROM.hpp

couldn't find in vpath: JVM.hpp

couldn't find in vpath: ROMImage.hpp

couldn't find in vpath: OS.hpp

couldn't find in vpath: ROMImage.hpp

couldn't find in vpath: OS.hpp

couldn't find in vpath: ROM.hpp

couldn't find in vpath: JVM.hpp

couldn't find in vpath: ROMImage.hpp

couldn't find in vpath: ROMImage.hpp

couldn't find in vpath: OS.hpp

couldn't find in vpath: ROMImage.hpp

couldn't find in vpath: OS.hpp

couldn't find in vpath: ROMImage.hpp

couldn't find in vpath: OS.hpp

couldn't find in vpath: ROMImage.hpp

couldn't find in vpath: OS.hpp

couldn't find in vpath: ROMImage.hpp

couldn't find in vpath: OS.hpp

couldn't find in vpath: ROMImage.hpp

couldn't find in vpath: OS.hpp

couldn't find in vpath: ROM.hpp

couldn't find in vpath: ROMImage.hpp

couldn't find in vpath: OS.hpp

couldn't find in vpath: ROM.hpp

couldn't find in vpath: ROMTools.hpp

couldn't find in vpath: ROMProfile.hpp

couldn't find in vpath: ROMOptimizer.hpp

couldn't find in vpath: ROMWriter.hpp

couldn't find in vpath: JVM.hpp

couldn't find in vpath: SourceROMWriter.hpp

couldn't find in vpath: BinaryROMWriter.hpp

couldn't find in vpath: SegmentedSourceROMWriter.hpp

couldn't find in vpath: ROMImage.hpp

couldn't find in vpath: OS.hpp

couldn't find in vpath: ROM.hpp

couldn't find in vpath: ROMImage.hpp

couldn't find in vpath: OS.hpp

couldn't find in vpath: ROM.hpp

couldn't find in vpath: ROMImage.hpp

couldn't find in vpath: OS.hpp

couldn't find in vpath: ROM.hpp

couldn't find in vpath: ROMTools.hpp

couldn't find in vpath: ROMProfile.hpp

couldn't find in vpath: ROMOptimizer.hpp

couldn't find in vpath: ROMWriter.hpp

couldn't find in vpath: JVM.hpp

couldn't find in vpath: SourceROMWriter.hpp

couldn't find in vpath: BinaryROMWriter.hpp

couldn't find in vpath: BytecodeOptimizer.hpp

couldn't find in vpath: ConstantPoolRewriter.hpp

couldn't find in vpath: ROMStructsWriter.hpp

couldn't find in vpath: ROMImage.hpp

couldn't find in vpath: OS.hpp

couldn't find in vpath: ROM.hpp

couldn't find in vpath: ROMTools.hpp

couldn't find in vpath: ROMProfile.hpp

couldn't find in vpath: ROMOptimizer.hpp

couldn't find in vpath: JVM.hpp

couldn't find in vpath: BytecodeOptimizer.hpp

couldn't find in vpath: ConstantPoolRewriter.hpp

couldn't find in vpath: MethodInvocationClosure.hpp

couldn't find in vpath: ROMInliner.hpp

couldn't find in vpath: ROMWriter.hpp

couldn't find in vpath: SourceROMWriter.hpp

couldn't find in vpath: SegmentedSourceROMWriter.hpp

couldn't find in vpath: BinaryROMWriter.hpp

couldn't find in vpath: ROMImage.hpp

couldn't find in vpath: ROMImage.hpp

couldn't find in vpath: OS.hpp

couldn't find in vpath: ROMImage.hpp

couldn't find in vpath: OS.hpp

couldn't find in vpath: ROMImage.hpp

couldn't find in vpath: OS.hpp

couldn't find in vpath: ROMImage.hpp

couldn't find in vpath: OS.hpp

couldn't find in vpath: ROMImage.hpp

couldn't find in vpath: OS.hpp

couldn't find in vpath: ROM.hpp

couldn't find in vpath: MethodInvocationClosure.hpp

couldn't find in vpath: ROMTools.hpp

couldn't find in vpath: ROMProfile.hpp

couldn't find in vpath: ROMOptimizer.hpp

couldn't find in vpath: ROMInliner.hpp

couldn't find in vpath: JVM.hpp

couldn't find in vpath: ROMWriter.hpp

couldn't find in vpath: SourceROMWriter.hpp

couldn't find in vpath: SegmentedSourceROMWriter.hpp

couldn't find in vpath: ROMImage.hpp

couldn't find in vpath: OS.hpp

couldn't find in vpath: ROM.hpp

couldn't find in vpath: ROMImage.hpp

couldn't find in vpath: OS.hpp

couldn't find in vpath: ROM.hpp

couldn't find in vpath: ROMImage.hpp

couldn't find in vpath: OS.hpp

couldn't find in vpath: ROM.hpp

make[1]: Leaving directory `/home/phoneme_feature/build_output/cldc/
linux_arm_926/loopgen/app'

make[1]: Entering directory `/home/phoneme_feature/build_output/cldc/
linux_arm_926/loopgen/app'

==================================================

GNU_TOOLS_DIR = /usr/local/buildroot/build_arm/staging_dir

==================================================

mkdir -p ../bin

mkdir -p ../../dist/bin

mkdir -p ../../dist/lib

mkdir -p ../../dist/include

==============================

compiling cldc1.1 classes (98 files)...

preverifying classes...

make[2]: Entering directory `/home/phoneme_feature/build_output/cldc/
linux_arm_926/loopgen/app'

installed ../../dist/bin/preverify

make[2]: Leaving directory `/home/phoneme_feature/build_output/cldc/
linux_arm_926/loopgen/app'

rm -rf /home/phoneme_feature/build_output/cldc/classes.zip /home/
phoneme_feature/build_output/cldc/tmpclasses

==============================

generating ../generated/NativesTable.cpp ...

make[1]: *** No rule to make target `ROMImage.hpp', needed by
`FloatSupport_arm.o'. Stop.

make[1]: Leaving directory `/home/phoneme_feature/build_output/cldc/
linux_arm_926/loopgen/app'

make: *** [_loopgen] Error 2

[root@localhost phoneme_feature]#

asif_kalim
Offline
Joined: 2007-11-30

gammy,

can u send me the make command variables for this build,

also check the nature of float support of you toochain, cldc floating options variables must be synchronized with the float support nature of your toolchain. is it supports hardware floating point ?
which crosstool toolchain are you using?

--
asif

gammy
Offline
Joined: 2008-01-08

Hi asif,

this time i am stuct at this point .did u face this error?

make[1]: Entering directory `/home/jay/phoneme_feature/cldc/build/linux_arm_926'
... copied root Makefiles
make[1]: Leaving directory `/home/jay/phoneme_feature/cldc/build/linux_arm_926'
==================================
JVMBuildSpace = /home/jay/phoneme_feature/build_output/cldc
JVMWorkSpace = /home/jay/phoneme_feature/cldc
ROMIZING = true
SHELL = /bin/sh
ENABLE_ISOLATES = true
ENABLE_MONET =
==================================
created /home/jay/phoneme_feature/build_output/cldc/linux_arm_926/tools/Makefile
==============================
creating build tools...
==============================
make[1]: Entering directory `/home/jay/phoneme_feature/build_output/cldc/linux_arm_926/tools'
Note: Some input files use or override a deprecated API.
Note: Recompile with -deprecation for details.
created jcc.jar
created buildtool.jar
make[1]: Leaving directory `/home/jay/phoneme_feature/build_output/cldc/linux_arm_926/tools'
done
Finding .java files ...
done
created /home/jay/phoneme_feature/build_output/cldc/linux_arm_926/loopgen/app/Makefile
==============================
creating ASM loop generator in debug mode
build flags: NO_DEBUG_SYMBOLS=true
==============================
make[1]: Entering directory `/home/jay/phoneme_feature/build_output/cldc/linux_arm_926/loopgen/app'
generating ../generated/Dependencies ...
reading database: /home/jay/phoneme_feature/cldc/src/vm/includeDB
merging source files, limit = 35
excluded from merging: JarFileUncommon.cpp
excluded from merging: OsFile.cpp
excluded from merging: OsFile_linux.cpp
excluded from merging: OsMemory.cpp
excluded from merging: OsMemory_linux.cpp
excluded from merging: OsMisc_linux.cpp
excluded from merging: OsSocket_linux.cpp
excluded from merging: OS_linux.cpp
excluded from merging: KniUncommon.cpp
excluded from merging: NativesTable.cpp
excluded from merging: FloatSupport_arm.cpp
excluded from merging: ROMImage.cpp
excluded from merging: jvmspi.cpp
excluded from merging: Main_linux.cpp
excluded from merging: BSDSocket.cpp
excluded from merging: PCSLSocket.cpp
excluded from merging: HotRoutines0.cpp
excluded from merging: HotRoutines1.cpp
excluded from merging: ReflectNatives.cpp
writing individual include files ... done (25 files.)
writing grand include file

writing dependencies file

make[1]: Leaving directory `/home/jay/phoneme_feature/build_output/cldc/linux_arm_926/loopgen/app'
make[1]: Entering directory `/home/jay/phoneme_feature/build_output/cldc/linux_arm_926/loopgen/app'
==================================================
GNU_TOOLS_DIR = /usr/local/buildroot/build_arm/staging_dir
==================================================
mkdir -p ../bin
mkdir -p ../../dist/bin
mkdir -p ../../dist/lib
mkdir -p ../../dist/include
generating ../generated/NativesTable.cpp ...
... FloatSupport_arm.cpp
/bin/sh: /usr/local/buildroot/build_arm/staging_dir/bin/g++: No such file or directory
make[1]: *** [FloatSupport_arm.o] Error 127
make[1]: Leaving directory `/home/jay/phoneme_feature/build_output/cldc/linux_arm_926/loopgen/app'
make: *** [_loopgen] Error 2