Skip to main content

new errors of mr2 linux-x86-suse pbp!

3 replies [Last post]
pigboy
Offline
Joined: 2006-03-08
Points: 0

Hi all,

I begin to learn the mr2, and when i want to build the pbp for linux-x86-suse,and i used the command line like::
(qt2.3.10 is build for linux-x86 my desktop preinstall qt-3.1 also meet the errors below)
make J2ME_CLASSLIB=basis CVM_TERSEOUTPUT=false
CVM_PRELOAD_LIB=true QT_TARGET_DIR=/work/qt-2.3.10 bin

i meet the errors below:

../../build/linux-x86-suse/./obj/jdtrans.o ../../build/linux-x86-suse/./obj/jmemmgr.o ../../build/linux-x86-suse/./obj/jcdctmgr.o ../../build/linux-x86-suse/./obj/jcprepct.o ../../build/linux-x86-suse/./obj/jdinput.o ../../build/linux-x86-suse/./obj/jerror.o ../../build/linux-x86-suse/./obj/jmemnobs.o ../../build/linux-x86-suse/./obj/jchuff.o ../../build/linux-x86-suse/./obj/jcsample.o ../../build/linux-x86-suse/./obj/jdmainct.o ../../build/linux-x86-suse/./obj/jfdctflt.o ../../build/linux-x86-suse/./obj/jcinit.o ../../build/linux-x86-suse/./obj/jctrans.o ../../build/linux-x86-suse/./obj/jdmarker.o ../../build/linux-x86-suse/./obj/jfdctfst.o ../../build/linux-x86-suse/./obj/jquant1.o ../../build/linux-x86-suse/./obj/jcmainct.o ../../build/linux-x86-suse/./obj/jdapimin.o ../../build/linux-x86-suse/./obj/jdmaster.o ../../build/linux-x86-suse/./obj/jfdctint.o ../../build/linux-x86-suse/./obj/jquant2.o ../../build/linux-x86-suse/./obj/jcmarker.o ../../build/linux-x86-suse/./obj/jdapistd.o ../../build/linux-x86-suse/./obj/jdmerge.o ../../build/linux-x86-suse/./obj/jidctflt.o ../../build/linux-x86-suse/./obj/jutils.o ../../build/linux-x86-suse/./obj/libromjava.a ../../build/linux-x86-suse/./obj/fdlibm.a -lpthread -ldl -lm -lstdc++ -L/usr/X11R6/lib -lXext -lX11 -lSM -lICE -lXft -lXrender -lXrandr -lXinerama -L/work/qt-2.3.10/lib -lqt-mt -lstdc++ -lstdc++ -lm -L../../build/linux-x86-suse/./lib
/usr/bin/ld: cannot find -lqt-mt
collect2: ld returned 1 exit status
make: *** [../../build/linux-x86-suse/./bin/cvm] Error 1

if i set the QTEMBEDDED=true i won't pass the error of QtFontMetrics.o..

../../src/x86 -I../../src -I../../src/linux -I../../src/linux/native/java/net -I../../src/linux/native/common -I../../src/linux-x86 -I/work/qt-2.3.10/include -I/work/qt-2.3.10/include/qt -I../../src/share/basis/native/awt/qt -fno-rtti -o ../../build/linux-x86-suse/./obj/QtFontMetrics.o ../../src/share/basis/native/awt/qt/QtFontMetrics.cpp
In file included from /work/qt-2.3.10/include/qt.h:274,
from ../../src/share/basis/native/awt/qt/awt.h:32,
from ../../src/share/basis/native/awt/qt/QtFontMetrics.cpp:28:
/work/qt-2.3.10/include/qfontfactoryttf_qws.h:43:31: freetype/freetype.h: No such file or directory
In file included from /work/qt-2.3.10/include/qt.h:274,
from ../../src/share/basis/native/awt/qt/awt.h:32,
from ../../src/share/basis/native/awt/qt/QtFontMetrics.cpp:28:
/work/qt-2.3.10/include/qfontfactoryttf_qws.h:65: 'FT_Library' is used as a
type, but is not defined as a type.
make: *** [../../build/linux-x86-suse/./obj/QtFontMetrics.o] Error 1

111111..

errors also happened to mr1 when i want to build pbp..

make QTEMBEDDED=true QTOPIA=false J2ME_CLASSLIB=basis CVM_TERSEOUTPUT=false CVM_PRELOAD_LIB=true CVM_DEBUG=true QT_TARGET_DIR=/usr/lib/qt-3.1 bin

/java/io -I../../src/share/native/java/util/zip -I../../src/share/native/java/util/zip/zlib-1.1.3 -I../../build/linux-x86-suse/./generated/jni -I../../src/x86
-I../../src -I../../src/linux -I../../src/linux/native/java/net -I../../src/linux/native/common -I../../src/linux-x86 -I/usr/lib/qt-3.1/include -I/usr/lib/qt-3.1/include/qt -I../../src/share/basis/native/awt/qt -I../../src/share/basis/native/image/gif -I../../src/share/basis/native/image/jpeg/lib -fno-rtti -o ../../build/linux-x86-suse/./obj/QtFontMetrics.o ../../src/share/basis/native/awt/qt/QtFontMetrics.cpp
In file included from ../../src/share/basis/native/awt/qt/awt.h:28,
from ../../src/share/basis/native/awt/qt/QtFontMetrics.cpp:25:
/usr/lib/qt-3.1/include/qt.h:30:27: qplatformdefs.h: No such file or directory
/usr/lib/qt-3.1/include/qt.h:316:30: qfontmanager_qws.h: No such file or directory
/usr/lib/qt-3.1/include/qt.h:317:33: qfontfactorybdf_qws.h: No such file or directory
/usr/lib/qt-3.1/include/qt.h:318:32: qgfxvoodoodefs_qws.h: No such file or directory
/usr/lib/qt-3.1/include/qt.h:319:32: qgfxmatroxdefs_qws.h: No such file or directory
/usr/lib/qt-3.1/include/qt.h:320:29: qcopchannel_qws.h: No such file or directory
/usr/lib/qt-3.1/include/qt.h:321:32: qdirectpainter_qws.h: No such file or directory
/usr/lib/qt-3.1/include/qt.h:322:32: qmemorymanager_qws.h: No such file or directory
/usr/lib/qt-3.1/include/qt.h:323:33: qfontfactoryttf_qws.h: No such file or directory
/usr/lib/qt-3.1/include/qt.h:324:22: qgfx_qws.h: No such file or directory
/usr/lib/qt-3.1/include/qt.h:325:25: qgfxvnc_qws.h: No such file or directory
/usr/lib/qt-3.1/include/qt.h:327:28: qsoundqss_qws.h: No such file or directory
/usr/lib/qt-3.1/include/qt.h:329:28: qwsdisplay_qws.h: No such file or directory/usr/lib/qt-3.1/include/qt.h:330:28: qgfxraster_qws.h: No such file or directory/usr/lib/qt-3.1/include/qt.h:331:27: qwssocket_qws.h: No such file or directory
/usr/lib/qt-3.1/include/qt.h:332:31: qwsdecoration_qws.h: No such file or directory
/usr/lib/qt-3.1/include/qt.h:333:26: qwsutils_qws.h: No such file or directory
/usr/lib/qt-3.1/include/qt.h:334:27: qwscursor_qws.h: No such file or directory
/usr/lib/qt-3.1/include/qt.h:335:28: qwsmanager_qws.h: No such file or directory/usr/lib/qt-3.1/include/qt.h:336:38: qwsdefaultdecoration_qws.h: No such file or directory
/usr/lib/qt-3.1/include/qt.h:337:28: qwscommand_qws.h: No such file or directory/usr/lib/qt-3.1/include/qt.h:338:36: qwshydrodecoration_qws.h: No such file or directory
/usr/lib/qt-3.1/include/qt.h:339:35: qwskde2decoration_qws.h: No such file or directory
/usr/lib/qt-3.1/include/qt.h:340:34: qwskdedecoration_qws.h: No such file or directory
/usr/lib/qt-3.1/include/qt.h:341:35: qwsbeosdecoration_qws.h: No such file or directory
/usr/lib/qt-3.1/include/qt.h:342:29: qwsproperty_qws.h: No such file or directory
/usr/lib/qt-3.1/include/qt.h:343:34: qwsregionmanager_qws.h: No such file or directory
/usr/lib/qt-3.1/include/qt.h:344:26: qwsevent_qws.h: No such file or directory
/usr/lib/qt-3.1/include/qt.h:345:31: qwindowsystem_qws.h: No such file or directory
/usr/lib/qt-3.1/include/qt.h:346:38: qwswindowsdecoration_qws.h: No such file or directory
/usr/lib/qt-3.1/include/qt.h:347:34: qgfxdriverplugin_qws.h: No such file or directory
In file included from /usr/lib/qt-3.1/include/qt.h:348,
from ../../src/share/basis/native/awt/qt/awt.h:28,
from ../../src/share/basis/native/awt/qt/QtFontMetrics.cpp:25:
/usr/lib/qt-3.1/include/private/qgfxdriverinterface_p.h:62: parse error before
`{' token
/usr/lib/qt-3.1/include/qt.h:349:34: qkbddriverplugin_qws.h: No such file or directory
In file included from /usr/lib/qt-3.1/include/qt.h:350,
from ../../src/share/basis/native/awt/qt/awt.h:28,
from ../../src/share/basis/native/awt/qt/QtFontMetrics.cpp:25:
/usr/lib/qt-3.1/include/private/qkbddriverinterface_p.h:62: parse error before
`{' token
/usr/lib/qt-3.1/include/qt.h:351:36: qmousedriverplugin_qws.h: No such file or directory
In file included from /usr/lib/qt-3.1/include/qt.h:352,
from ../../src/share/basis/native/awt/qt/awt.h:28,
from ../../src/share/basis/native/awt/qt/QtFontMetrics.cpp:25:
/usr/lib/qt-3.1/include/private/qmousedriverinterface_p.h:62: parse error
before `{' token
make: *** [../../build/linux-x86-suse/./obj/QtFontMetrics.o] Error 1

make QTEMBEDDED=true QTOPIA=false J2ME_CLASSLIB=basis CVM_TERSEOUTPUT=false CVM_PRELOAD_LIB=true CVM_DEBUG=true QT_TARGET_DIR=/work/qt-2.3.10 bin

c++ ../../build/linux-x86-suse/./obj/QtFontMetrics.o
g++ -c -fno-common -Wall -fno-strict-aliasing -march=i686 -g -DCVM_DEBUG -DCVM_INSPECTOR -DCVM_DEBUG_CLASSINFO -DCVM_DEBUG_STACKTRACES -DCVM_DEBUG_DUMPSTACK -DCVM_DEBUG_ASSERTS -DCVM_CLASSLOADING -DCVM_SERIALIZATION -DCVM_REFLECT -DCVM_DYNAMIC_LINKING -DCVM_JIT_REGISTER_LOCALS -DCVM_TIMESTAMPING -DCVM_TRACE -DCVM_PRELOAD_LIB -DCVM_STATICLINK_LIBS -DJ2ME_CLASSLIB=basis -DTARGET_CPU_FAMILY=x86 -DCVM_TRACE_ENABLED -D_GNU_SOURCE -DCANNOT_COPY_64_AS_DOUBLE -DQWS -I../../src/share -I../../build/linux-x86-suse/. -I../../src/share/javavm/export -I../../src/share/native/common -I../../src/share/native/java/lang -I../../src/share/native/java/lang/fdlibm/include -I../../src/share/native/java/net -I../../src/share/native/java/io -I../../src/share/native/java/util/zip -I../../src/share/native/java/util/zip/zlib-1.1.3 -I../../build/linux-x86-suse/./generated/jni -I../../src/x86
-I../../src -I../../src/linux -I../../src/linux/native/java/net -I../../src/linux/native/common -I../../src/linux-x86 -I/work/qt-2.3.10/include -I/work/qt-2.3.10/include/qt -I../../src/share/basis/native/awt/qt -I../../src/share/basis/native/image/gif -I../../src/share/basis/native/image/jpeg/lib -fno-rtti -o ../../build/linux-x86-suse/./obj/QtFontMetrics.o ../../src/share/basis/native/awt/qt/QtFontMetrics.cpp
In file included from /work/qt-2.3.10/include/qt.h:274,
from ../../src/share/basis/native/awt/qt/awt.h:28,
from ../../src/share/basis/native/awt/qt/QtFontMetrics.cpp:25:
/work/qt-2.3.10/include/qfontfactoryttf_qws.h:43:31: freetype/freetype.h: No such file or directory
In file included from /work/qt-2.3.10/include/qt.h:274,
from ../../src/share/basis/native/awt/qt/awt.h:28,
from ../../src/share/basis/native/awt/qt/QtFontMetrics.cpp:25:
/work/qt-2.3.10/include/qfontfactoryttf_qws.h:65: 'FT_Library' is used as a
type, but is not defined as a type.
make: *** [../../build/linux-x86-suse/./obj/QtFontMetrics.o] Error 1

thanks!
WInson

Reply viewing options

Select your preferred way to display the comments and click "Save settings" to activate your changes.
pigboy
Offline
Joined: 2006-03-08
Points: 0

Thanks Hinkmond,

First ,my system is RH , so i can't use this command..

\\sudo apt-get install libfreetype6 libfreetype6-dev

but i did install the [u]freetype-delev.2.1.3-6.i386.rpms[/u]...not what the libfreetype6

but the problems is the same ,maybe you didn't see clearly about my errors(maybe i post too much??),i didnt set QTEMBEDDED=true , for the default seting flags for QTEMBEDDED=false.
even i set QTEMBEDDED=false obviously ,the error is the same....

> make J2ME_CLASSLIB=basis CVM_TERSEOUTPUT=false
> CVM_PRELOAD_LIB=true QT_TARGET_DIR=/work/qt-2.3.10 bin
>
> i meet the errors below:
>
> ../../build/linux-x86-suse/./obj/jdtrans.o ../../build/linux-x86-suse/./obj/jmemmgr.o ../../build/linux-x86-suse/./obj/jcdctmgr.o ../../build/linux-x86-suse/./obj/jcprepct.o ../../build/linux-x86-suse/./obj/jdinput.o ../../build/linux-x86-suse/./obj/jerror.o ../../build/linux-x86-suse/./obj/jmemnobs.o ../../build/linux-x86-suse/./obj/jchuff.o ../../build/linux-x86-suse/./obj/jcsample.o ../../build/linux-x86-suse/./obj/jdmainct.o ../../build/linux-x86-suse/./obj/jfdctflt.o ../../build/linux-x86-suse/./obj/jcinit.o ../../build/linux-x86-suse/./obj/jctrans.o ../../build/linux-x86-suse/./obj/jdmarker.o ../../build/linux-x86-suse/./obj/jfdctfst.o ../../build/linux-x86-suse/./obj/jquant1.o ../../build/linux-x86-suse/./obj/jcmainct.o ../../build/linux-x86-suse/./obj/jdapimin.o ../../build/linux-x86-suse/./obj/jdmaster.o ../../build/linux-x86-suse/./obj/jfdctint.o ../../build/linux-x86-suse/./obj/jquant2.o ../../build/linux-x86-suse/./obj/jcmarker.o ../../build/linux-x86-suse/./obj
/jdapistd.o ../../build/linux-x86-suse/./obj/jdmerge.o ../../build/linux-x86-suse/./obj/jidctflt.o ../../build/linux-x86-suse/./obj/jutils.o ../../build/linux-x86-suse/./obj/libromjava.a ../../build/linux-x86-suse/./obj/fdlibm.a -lpthread -ldl -lm -lstdc++ -L/usr/X11R6/lib -lXext -lX11 -lSM -lICE -lXft -lXrender -lXrandr -lXinerama -L/work/qt-2.3.10/lib -lqt-mt -lstdc++ -lstdc++ -lm -L../../build/linux-x86-suse/./lib
> /usr/bin/ld: cannot find -lqt-mt
> collect2: ld returned 1 exit status
> make: *** [../../build/linux-x86-suse/./bin/cvm] Error 1

[b]if i type ....[/b]

make J2ME_CLASSLIB=basis bin

.c++ ../../build/linux-x86-suse/./obj/QtFontMetrics.o
In file included from ../../src/share/basis/native/awt/qt/awt.h:32,
from ../../src/share/basis/native/awt/qt/QtFontMetrics.cpp:28:
/usr/lib/qt-3.1/include/qt.h:30:27: qplatformdefs.h: No such file or directory
make: *** [../../build/linux-x86-suse/./obj/QtFontMetrics.o] Error 1

[u]
BTW,you means by non-qtembedded version ,so what version should i download ?and when i build the qt for linux/x86,what configuration command should i use ?like
./configure -xplatform linux-x86-g++ ....or something esle?

thks

news errors when i type in .........
make J2ME_CLASSLIB=basis QT_TARGET_DIR=/work/qt-2.3.10

[/u]

3727 Java strings
c++ ../../build/linux-x86-suse/./obj/QtFontMetrics.o
c++ ../../build/linux-x86-suse/./obj/QtGraphics.o
c++ ../../build/linux-x86-suse/./obj/QtGraphicsConfiguration.o
c++ ../../build/linux-x86-suse/./obj/QtGraphicsDevice.o
c++ ../../build/linux-x86-suse/./obj/QtGraphicsEnv.o
c++ ../../build/linux-x86-suse/./obj/QtImage.o
c++ ../../build/linux-x86-suse/./obj/QtRobotHelper.o
c++ ../../build/linux-x86-suse/./obj/QtToolkit.o
c++ ../../build/linux-x86-suse/./obj/Window.o
c++ ../../build/linux-x86-suse/./obj/QtBackEnd.o
c++ ../../build/linux-x86-suse/./obj/QtApplication.o
c++ ../../build/linux-x86-suse/./obj/QtSync.o
c++ ../../build/linux-x86-suse/./obj/QtORB.o
c++ ../../build/linux-x86-suse/./obj/QpObject.o
c++ ../../build/linux-x86-suse/./obj/QpRobot.o
c++ ../../build/linux-x86-suse/./obj/QtScreenFactory.o
cc ../../build/linux-x86-suse/./obj/gifdecoder.o
Linking ../../build/linux-x86-suse/./lib/libqtawt.so
/usr/bin/ld: cannot find -lqt-mt
collect2: ld returned 1 exit status
make: *** [../../build/linux-x86-suse/./lib/libqtawt.so] Error 1
Winson

Hinkmond Wong

phonemeadvanced@mobileandembedded.org wrote:
> [u]Hi all,
>
> I begin to learn the[/u] mr2, and when i want to build the pbp for linux-x86-suse,and i used the command line like::
> (qt2.3.10 is build for linux-x86 my desktop preinstall qt-3.1 also meet the errors below)
> make J2ME_CLASSLIB=basis CVM_TERSEOUTPUT=false
> CVM_PRELOAD_LIB=true QT_TARGET_DIR=/work/qt-2.3.10 bin
>
> i meet the errors below:
>
> ../../build/linux-x86-suse/./obj/jdtrans.o ../../build/linux-x86-suse/./obj/jmemmgr.o ../../build/linux-x86-suse/./obj/jcdctmgr.o ../../build/linux-x86-suse/./obj/jcprepct.o ../../build/linux-x86-suse/./obj/jdinput.o ../../build/linux-x86-suse/./obj/jerror.o ../../build/linux-x86-suse/./obj/jmemnobs.o ../../build/linux-x86-suse/./obj/jchuff.o ../../build/linux-x86-suse/./obj/jcsample.o ../../build/linux-x86-suse/./obj/jdmainct.o ../../build/linux-x86-suse/./obj/jfdctflt.o ../../build/linux-x86-suse/./obj/jcinit.o ../../build/linux-x86-suse/./obj/jctrans.o ../../build/linux-x86-suse/./obj/jdmarker.o ../../build/linux-x86-suse/./obj/jfdctfst.o ../../build/linux-x86-suse/./obj/jquant1.o ../../build/linux-x86-suse/./obj/jcmainct.o ../../build/linux-x86-suse/./obj/jdapimin.o ../../build/linux-x86-suse/./obj/jdmaster.o ../../build/linux-x86-suse/./obj/jfdctint.o ../../build/linux-x86-suse/./obj/jquant2.o ../../build/linux-x86-suse/./obj/jcmarker.o ../../build/linux-x86-suse/./obj
/jdapistd.o ../../build/linux-x86-suse/./obj/jdmerge.o ../../build/linux-x86-suse/./obj/jidctflt.o ../../build/linux-x86-suse/./obj/jutils.o ../../build/linux-x86-suse/./obj/libromjava.a ../../build/linux-x86-suse/./obj/fdlibm.a -lpthread -ldl -lm -lstdc++ -L/usr/X11R6/lib -lXext -lX11 -lSM -lICE -lXft -lXrender -lXrandr -lXinerama -L/work/qt-2.3.10/lib -lqt-mt -lstdc++ -lstdc++ -lm -L../../build/linux-x86-suse/./lib
> /usr/bin/ld: cannot find -lqt-mt
> collect2: ld returned 1 exit status
> make: *** [../../build/linux-x86-suse/./bin/cvm] Error 1
>
> if i set the QTEMBEDDED=true i won't pass the error of QtFontMetrics.o..
>
> ../../src/x86 -I../../src -I../../src/linux -I../../src/linux/native/java/net -I../../src/linux/native/common -I../../src/linux-x86 -I/work/qt-2.3.10/include -I/work/qt-2.3.10/include/qt -I../../src/share/basis/native/awt/qt -fno-rtti -o ../../build/linux-x86-suse/./obj/QtFontMetrics.o ../../src/share/basis/native/awt/qt/QtFontMetrics.cpp
> In file included from /work/qt-2.3.10/include/qt.h:274,
> from ../../src/share/basis/native/awt/qt/awt.h:32,
> from ../../src/share/basis/native/awt/qt/QtFontMetrics.cpp:28:
> /work/qt-2.3.10/include/qfontfactoryttf_qws.h:43:31: freetype/freetype.h: No such file or directory
> In file included from /work/qt-2.3.10/include/qt.h:274,
> from ../../src/share/basis/native/awt/qt/awt.h:32,
> from ../../src/share/basis/native/awt/qt/QtFontMetrics.cpp:28:
> /work/qt-2.3.10/include/qfontfactoryttf_qws.h:65: 'FT_Library' is used as a
> type, but is not defined as a type.
> make: *** [../../build/linux-x86-suse/./obj/QtFontMetrics.o] Error 1

You don't want to set QTEMBEDDED=true, since you installed and are using
a non-embedded version of Qt in your /work/qt-2.3.10 directory. So, set
QTEMBEDDED=false and fix your freetype/freetype.h (No such file) error.

To fix that freetype error, you need to install freetype onto your Linux
system.

For example, on a Debian or Ubuntu system, you do this:

sudo apt-get install libfreetype6 libfreetype6-dev

Hinkmond

---------------------------------------------------------------------
To unsubscribe, e-mail: advanced-unsubscribe@phoneme.dev.java.net
For additional commands, e-mail: advanced-help@phoneme.dev.java.net

pigboy
Offline
Joined: 2006-03-08
Points: 0

Thanks Hinkmond,

First ,my system is RH , so i can't use this command..

\\sudo apt-get install libfreetype6 libfreetype6-dev

but i did install the [u]freetype-delev.2.1.3-6.i386.rpms[/u]...not what the libfreetype6

but the problems is the same ,maybe you didn't see clearly about my errors(maybe i post too much??),i didnt set QTEMBEDDED=true , for the default seting flags for QTEMBEDDED=false.
even i set QTEMBEDDED=false obviously ,the error is the same....

> make J2ME_CLASSLIB=basis CVM_TERSEOUTPUT=false
> CVM_PRELOAD_LIB=true QT_TARGET_DIR=/work/qt-2.3.10 bin
>
> i meet the errors below:
>
> ../../build/linux-x86-suse/./obj/jdtrans.o ../../build/linux-x86-suse/./obj/jmemmgr.o ../../build/linux-x86-suse/./obj/jcdctmgr.o ../../build/linux-x86-suse/./obj/jcprepct.o ../../build/linux-x86-suse/./obj/jdinput.o ../../build/linux-x86-suse/./obj/jerror.o ../../build/linux-x86-suse/./obj/jmemnobs.o ../../build/linux-x86-suse/./obj/jchuff.o ../../build/linux-x86-suse/./obj/jcsample.o ../../build/linux-x86-suse/./obj/jdmainct.o ../../build/linux-x86-suse/./obj/jfdctflt.o ../../build/linux-x86-suse/./obj/jcinit.o ../../build/linux-x86-suse/./obj/jctrans.o ../../build/linux-x86-suse/./obj/jdmarker.o ../../build/linux-x86-suse/./obj/jfdctfst.o ../../build/linux-x86-suse/./obj/jquant1.o ../../build/linux-x86-suse/./obj/jcmainct.o ../../build/linux-x86-suse/./obj/jdapimin.o ../../build/linux-x86-suse/./obj/jdmaster.o ../../build/linux-x86-suse/./obj/jfdctint.o ../../build/linux-x86-suse/./obj/jquant2.o ../../build/linux-x86-suse/./obj/jcmarker.o ../../build/linux-x86-suse/./obj
/jdapistd.o ../../build/linux-x86-suse/./obj/jdmerge.o ../../build/linux-x86-suse/./obj/jidctflt.o ../../build/linux-x86-suse/./obj/jutils.o ../../build/linux-x86-suse/./obj/libromjava.a ../../build/linux-x86-suse/./obj/fdlibm.a -lpthread -ldl -lm -lstdc++ -L/usr/X11R6/lib -lXext -lX11 -lSM -lICE -lXft -lXrender -lXrandr -lXinerama -L/work/qt-2.3.10/lib -lqt-mt -lstdc++ -lstdc++ -lm -L../../build/linux-x86-suse/./lib
> /usr/bin/ld: cannot find -lqt-mt
> collect2: ld returned 1 exit status
> make: *** [../../build/linux-x86-suse/./bin/cvm] Error 1

[b]if i type ....[/b]

make J2ME_CLASSLIB=basis bin

.c++ ../../build/linux-x86-suse/./obj/QtFontMetrics.o
In file included from ../../src/share/basis/native/awt/qt/awt.h:32,
from ../../src/share/basis/native/awt/qt/QtFontMetrics.cpp:28:
/usr/lib/qt-3.1/include/qt.h:30:27: qplatformdefs.h: No such file or directory
make: *** [../../build/linux-x86-suse/./obj/QtFontMetrics.o] Error 1